Reaction Details
TargetEpidermal growth factor receptor
LigandBDBM4397
Substrate/Competitorn/a
Meas. Tech.ChEMBL_619932 (CHEMBL1113143)
IC50 2700±n/a nM
Citation Felts, ASSaleh, SALe, URodriguez, ALWeaver, CDConn, PJLindsley, CWEmmitte, KA Discovery and SAR of 6-substituted-4-anilinoquinazolines as non-competitive antagonists of mGlu5. Bioorg Med Chem Lett19:6623-6 (2009) 
 
Epidermal growth factor receptor
Name:Epidermal growth factor receptor
Type:Receptor Kinase Domain
Mol. Mass.:134279.59
Organism:Homo sapiens (Human)
Description:P00533
Residue:1210
BDBM4397
NameBDBM4397
Synonyms:4-Anilidoquinazoline deriv. 12a | 6-chloro-N-(3-chlorophenyl)quinazolin-4-amine
TypeSmall organic molecule
Emp. Form.C14H9Cl2N3
Mol. Mass.290.147
SMILESClc1cccc(Nc2ncnc3ccc(Cl)cc23)c1