Reaction Details
TargetInsulin receptor
LigandBDBM50311897
Substrate/Competitorn/a
Meas. Tech.ChEMBL_619940 (CHEMBL1113982)
IC50 29±n/a nM
Citation Zhang, GRen, PGray, NSSim, TWang, XLiu, YChe, JDong, WTian, SSSandberg, MLSpalding, TARomeo, RIskandar, MWang, ZSeidel, HMKaranewsky, DSHe, Y Discovery of pyrimidine benzimidazoles as Src-family selective Lck inhibitors. Part II. Bioorg Med Chem Lett19:6691-5 (2009) 
 
Insulin receptor
Name:Insulin receptor
Type:Receptor Tyrosine Kinase
Mol. Mass.:156322.60
Organism:Homo sapiens (Human)
Description:P06213
Residue:1382
BDBM50311897
NameBDBM50311897
Synonyms:3-(1-(6-aminopyrimidin-4-yl)-1H-benzo[d]imidazol-2-ylamino)-N-(3-isopropylphenyl)-4-methylbenzamide | CHEMBL1087127
TypeSmall organic molecule
Emp. Form.C28H27N7O
Mol. Mass.477.5603
SMILESCC(C)c1cccc(NC(=O)c2ccc(C)c(Nc3nc4ccccc4n3-c3cc(N)ncn3)c2)c1