Reaction Details
TargetTyrosine-protein kinase Lck
LigandBDBM50311944
Substrate/Competitorn/a
Meas. Tech.ChEMBL_619933 (CHEMBL1113975)
IC50 13±n/a nM
Citation Zhang, GRen, PGray, NSSim, TWang, XLiu, YChe, JDong, WTian, SSSandberg, MLSpalding, TARomeo, RIskandar, MWang, ZSeidel, HMKaranewsky, DSHe, Y Discovery of pyrimidine benzimidazoles as Src-family selective Lck inhibitors. Part II. Bioorg Med Chem Lett19:6691-5 (2009) 
 
Tyrosine-protein kinase Lck
Name:Tyrosine-protein kinase Lck
Type:n/a
Mol. Mass.:57987.83
Organism:Homo sapiens (Human)
Description:P06239
Residue:509
BDBM50311944
NameBDBM50311944
Synonyms:CHEMBL1076466 | N-(3-(1-(6-(4-aminobutylamino)pyrimidin-4-yl)-1H-benzo[d]imidazol-2-ylamino)-4-methylphenyl)-3-(trifluoromethyl)benzamide
TypeSmall organic molecule
Emp. Form.C30H29F3N8O
Mol. Mass.574.5995
SMILESCc1ccc(NC(=O)c2cccc(c2)C(F)(F)F)cc1Nc1nc2ccccc2n1-c1cc(NCCCCN)ncn1