Reaction Details
TargetInsulin receptor
LigandBDBM50311915
Substrate/Competitorn/a
Meas. Tech.ChEMBL_619940 (CHEMBL1113982)
IC50 1365±n/a nM
Citation Zhang, GRen, PGray, NSSim, TWang, XLiu, YChe, JDong, WTian, SSSandberg, MLSpalding, TARomeo, RIskandar, MWang, ZSeidel, HMKaranewsky, DSHe, Y Discovery of pyrimidine benzimidazoles as Src-family selective Lck inhibitors. Part II. Bioorg Med Chem Lett19:6691-5 (2009) 
 
Insulin receptor
Name:Insulin receptor
Type:Receptor Tyrosine Kinase
Mol. Mass.:156322.60
Organism:Homo sapiens (Human)
Description:P06213
Residue:1382
BDBM50311915
NameBDBM50311915
Synonyms:4-methyl-3-(1-(4-(3-(4-methylpiperazin-1-yl)propylamino)-1,3,5-triazin-2-yl)-1H-benzo[d]imidazol-2-ylamino)-N-(3-(trifluoromethyl)phenyl)benzamide | CHEMBL1076203
TypeSmall organic molecule
Emp. Form.C33H35F3N10O
Mol. Mass.644.6926
SMILESCN1CCN(CCCNc2ncnc(n2)-n2c(Nc3cc(ccc3C)C(=O)Nc3cccc(c3)C(F)(F)F)nc3ccccc23)CC1