Reaction Details
TargetTyrosine-protein kinase Lck
LigandBDBM50311891
Substrate/Competitorn/a
Meas. Tech.ChEMBL_619936 (CHEMBL1113978)
IC50 20±n/a nM
Citation Zhang, GRen, PGray, NSSim, TWang, XLiu, YChe, JDong, WTian, SSSandberg, MLSpalding, TARomeo, RIskandar, MWang, ZSeidel, HMKaranewsky, DSHe, Y Discovery of pyrimidine benzimidazoles as Src-family selective Lck inhibitors. Part II. Bioorg Med Chem Lett19:6691-5 (2009) 
 
Tyrosine-protein kinase Lck
Name:Tyrosine-protein kinase Lck
Type:n/a
Mol. Mass.:57987.83
Organism:Homo sapiens (Human)
Description:P06239
Residue:509
BDBM50311891
NameBDBM50311891
Synonyms:3-(1-(6-(4-(diethylamino)butylamino)pyrimidin-4-yl)-1H-benzo[d]imidazol-2-ylamino)-4-methyl-N-m-tolylbenzamide | CHEMBL1076195
TypeSmall organic molecule
Emp. Form.C34H40N8O
Mol. Mass.576.7344
SMILESCCN(CC)CCCCNc1cc(ncn1)-n1c(Nc2cc(ccc2C)C(=O)Nc2cccc(C)c2)nc2ccccc12