Reaction Details
TargetTyrosine-protein kinase Lck
LigandBDBM50311931
Substrate/Competitorn/a
Meas. Tech.ChEMBL_619936 (CHEMBL1113978)
IC50 108±n/a nM
Citation Zhang, GRen, PGray, NSSim, TWang, XLiu, YChe, JDong, WTian, SSSandberg, MLSpalding, TARomeo, RIskandar, MWang, ZSeidel, HMKaranewsky, DSHe, Y Discovery of pyrimidine benzimidazoles as Src-family selective Lck inhibitors. Part II. Bioorg Med Chem Lett19:6691-5 (2009) 
 
Tyrosine-protein kinase Lck
Name:Tyrosine-protein kinase Lck
Type:n/a
Mol. Mass.:57987.83
Organism:Homo sapiens (Human)
Description:P06239
Residue:509
BDBM50311931
NameBDBM50311931
Synonyms:CHEMBL1076469 | N-(3-(1-(6-(4-(dimethylamino)butylamino)pyrimidin-4-yl)-1H-benzo[d]imidazol-2-ylamino)-4-methylphenyl)-3-(trifluoromethyl)benzamide
TypeSmall organic molecule
Emp. Form.C32H33F3N8O
Mol. Mass.602.6526
SMILESCN(C)CCCCNc1cc(ncn1)-n1c(Nc2cc(NC(=O)c3cccc(c3)C(F)(F)F)ccc2C)nc2ccccc12