Reaction Details
TargetVascular endothelial growth factor receptor 2
LigandBDBM50311889
Substrate/Competitorn/a
Meas. Tech.ChEMBL_619939 (CHEMBL1113981)
IC50 20±n/a nM
Citation Zhang, GRen, PGray, NSSim, TWang, XLiu, YChe, JDong, WTian, SSSandberg, MLSpalding, TARomeo, RIskandar, MWang, ZSeidel, HMKaranewsky, DSHe, Y Discovery of pyrimidine benzimidazoles as Src-family selective Lck inhibitors. Part II. Bioorg Med Chem Lett19:6691-5 (2009) 
 
Vascular endothelial growth factor receptor 2
Name:Vascular endothelial growth factor receptor 2
Type:Receptor Tyrosine Kinase
Mol. Mass.:151510.97
Organism:Homo sapiens (Human)
Description:P35968
Residue:1356
BDBM50311889
NameBDBM50311889
Synonyms:3-(1-(6-aminopyrimidin-4-yl)-1H-benzo[d]imidazol-2-ylamino)-4-methyl-N-(3-(4-methyl-1H-imidazol-1-yl)-5-(trifluoromethyl)phenyl)benzamide | CHEMBL1076193
TypeSmall organic molecule
Emp. Form.C30H24F3N9O
Mol. Mass.583.5665
SMILESCc1cn(cn1)-c1cc(NC(=O)c2ccc(C)c(Nc3nc4ccccc4n3-c3cc(N)ncn3)c2)cc(c1)C(F)(F)F