Reaction Details
TargetProtein kinase C delta type
LigandBDBM50311949
Substrate/Competitorn/a
Meas. Tech.ChEMBL_619964 (CHEMBL1114006)
IC50 9400±n/a nM
Citation Shim, JEid, CLee, JLiu, EChaudhary, DBoschelli, DH Synthesis and PKCtheta inhibitory activity of a series of 5-vinyl phenyl sulfonamide-3-pyridinecarbonitriles. Bioorg Med Chem Lett19:6575-7 (2009) 
 
Protein kinase C delta type
Name:Protein kinase C delta type
Type:Enzyme
Mol. Mass.:77516.79
Organism:Homo sapiens (Human)
Description:The recombinant human PKC enzymes were produced using a baculovirus expression system in SF9 cells
Residue:676
BDBM50311949
NameBDBM50311949
Synonyms:4-(2-(5-cyano-4-(4-methyl-1H-indol-5-ylamino)pyridin-3-yl)vinyl)-N,N-diisopropylbenzenesulfonamide | CHEMBL1079376
TypeSmall organic molecule
Emp. Form.C29H31N5O2S
Mol. Mass.513.654
SMILESCC(C)N(C(C)C)S(=O)(=O)c1ccc(\C=C\c2cncc(C#N)c2Nc2ccc3[nH]ccc3c2C)cc1