Reaction Details
Target5-hydroxytryptamine receptor 6
LigandBDBM50313121
Substrate/Competitorn/a
Meas. Tech.ChEMBL_616576 (CHEMBL1099713)
Ki 1.3±n/a nM
Citation Bernotas, RCAntane, SShenoy, RLe, VDChen, PHarrison, BLRobichaud, AJZhang, GMSmith, DSchechter, LE 3-(Arylsulfonyl)-1-(azacyclyl)-1H-indoles are 5-HT(6) receptor modulators. Bioorg Med Chem Lett20:1657-60 (2010) 
 
5-hydroxytryptamine receptor 6
Name:5-hydroxytryptamine receptor 6
Type:G Protein-Coupled Receptor (GPCR)
Mol. Mass.:46968.43
Organism:Homo sapiens (Human)
Description:P50406
Residue:440
BDBM50313121
NameBDBM50313121
Synonyms:3-(3-chlorophenylsulfonyl)-1-(1-methylpyrrolidin-3-yl)-1H-indole | CHEMBL1086719
TypeSmall organic molecule
Emp. Form.C19H19ClN2O2S
Mol. Mass.374.884
SMILESCN1CCC(C1)n1cc(c2ccccc12)S(=O)(=O)c1cccc(Cl)c1