Reaction Details
Target5-hydroxytryptamine receptor 6
LigandBDBM50313125
Substrate/Competitorn/a
Meas. Tech.ChEMBL_616576 (CHEMBL1099713)
Ki 1.5±n/a nM
Citation Bernotas, RCAntane, SShenoy, RLe, VDChen, PHarrison, BLRobichaud, AJZhang, GMSmith, DSchechter, LE 3-(Arylsulfonyl)-1-(azacyclyl)-1H-indoles are 5-HT(6) receptor modulators. Bioorg Med Chem Lett20:1657-60 (2010) 
 
5-hydroxytryptamine receptor 6
Name:5-hydroxytryptamine receptor 6
Type:G Protein-Coupled Receptor (GPCR)
Mol. Mass.:46968.43
Organism:Homo sapiens (Human)
Description:P50406
Residue:440
BDBM50313125
NameBDBM50313125
Synonyms:8-(1-(pyrrolidin-3-yl)-1H-indol-3-ylsulfonyl)quinoline | CHEMBL1080729
TypeSmall organic molecule
Emp. Form.C21H19N3O2S
Mol. Mass.377.459
SMILESO=S(=O)(c1cn(C2CCNC2)c2ccccc12)c1cccc2cccnc12