Reaction Details
TargetEstrogen receptor
LigandBDBM50313149
Substrate/Competitorn/a
Meas. Tech.ChEMBL_616600 (CHEMBL1100140)
Ki 4200±n/a nM
Citation Mita, YDodo, KNoguchi-Yachide, TMiyachi, HMakishima, MHashimoto, YIshikawa, M LXXLL peptide mimetics as inhibitors of the interaction of vitamin D receptor with coactivators. Bioorg Med Chem Lett20:1712-7 (2010) 
 
Estrogen receptor
Name:Estrogen receptor
Type:Protein
Mol. Mass.:66230.44
Organism:Homo sapiens (Human)
Description:P03372
Residue:595
BDBM50313149
NameBDBM50313149
Synonyms:6-(2-benzylpyridin-4-yl)-3-hydroxy-5-isobutyl-1-(naphthalen-2-ylmethyl)pyridin-2(1H)-one | CHEMBL1087252
TypeSmall organic molecule
Emp. Form.C32H30N2O2
Mol. Mass.474.5928
SMILESCC(C)Cc1cc(O)c(=O)n(Cc2ccc3ccccc3c2)c1-c1ccnc(Cc2ccccc2)c1