Reaction Details
TargetMetacaspase-2
LigandBDBM50313777
Substrate/Competitorn/a
Meas. Tech.ChEMBL_614949 (CHEMBL1116826)
IC50 1400±n/a nM
Citation Berg, MVan der Veken, PJoossens, JMuthusamy, VBreugelmans, MMoss, CXRudolf, JCos, PCoombs, GHMaes, LHaemers, AMottram, JCAugustyns, K Design and evaluation of Trypanosoma brucei metacaspase inhibitors. Bioorg Med Chem Lett20:2001-6 (2010) 
 
Metacaspase-2
Name:Metacaspase-2
Synonyms:Metacaspase
Type:PROTEIN
Mol. Mass.:37791.17
Organism:Trypanosoma brucei
Description:ChEMBL_614949
Residue:347
BDBM50313777
NameBDBM50313777
TypeSmall organic molecule
Emp. Form.C27H34N6O4S
Mol. Mass.538.662
SMILES[#6]-[#6](-[#6])-[#6]-[#6](-[#7]-[#6](=O)-[#8]-[#6]-c1ccccc1)-[#6](=O)-[#7]-[#6@@H](-[#6]-[#6]-[#6]\[#7]=[#6](\[#7])-[#7])-[#6](=O)-c1nc2ccccc2s1