Reaction Details
TargetSerine/threonine-protein kinase B-raf
LigandBDBM50314048
Substrate/Competitorn/a
Meas. Tech.ChEMBL_626942 (CHEMBL1109830)
IC50>10000±n/a nM
Citation Gopalsamy, ACiszewski, GShi, MBerger, DHu, YLee, FFeldberg, LFrommer, EKim, SCollins, KWojciechowicz, DMallon, R Hit to lead optimization of pyrazolo[1,5-a]pyrimidines as B-Raf kinase inhibitors. Bioorg Med Chem Lett19:6890-2 (2009) 
 
Serine/threonine-protein kinase B-raf
Name:Serine/threonine-protein kinase B-raf
Type:Serine/threonine-protein kinase
Mol. Mass.:84446.00
Organism:Homo sapiens (Human)
Description:P15056
Residue:766
BDBM50314048
NameBDBM50314048
Synonyms:CHEMBL1089410 | N-(3-(2-(thiophen-2-yl)pyrazolo[1,5-a]pyrimidin-7-yl)phenyl)-3-(trifluoromethyl)benzamide
TypeSmall organic molecule
Emp. Form.C24H15F3N4OS
Mol. Mass.464.462
SMILESFC(F)(F)c1cccc(c1)C(=O)Nc1cccc(c1)-c1ccnc2cc(nn12)-c1cccs1