Reaction Details
TargetSerine/threonine-protein kinase B-raf
LigandBDBM50314050
Substrate/Competitorn/a
Meas. Tech.ChEMBL_626942 (CHEMBL1109830)
IC50 100±n/a nM
Citation Gopalsamy, ACiszewski, GShi, MBerger, DHu, YLee, FFeldberg, LFrommer, EKim, SCollins, KWojciechowicz, DMallon, R Hit to lead optimization of pyrazolo[1,5-a]pyrimidines as B-Raf kinase inhibitors. Bioorg Med Chem Lett19:6890-2 (2009) 
 
Serine/threonine-protein kinase B-raf
Name:Serine/threonine-protein kinase B-raf
Type:Serine/threonine-protein kinase
Mol. Mass.:84446.00
Organism:Homo sapiens (Human)
Description:P15056
Residue:766
BDBM50314050
NameBDBM50314050
Synonyms:CHEMBL1088768 | N-(3-(2-(1-methyl-1H-imidazol-5-yl)pyrazolo[1,5-a]pyrimidin-7-yl)phenyl)-3-(trifluoromethyl)benzamide
TypeSmall organic molecule
Emp. Form.C24H17F3N6O
Mol. Mass.462.4266
SMILESCn1cncc1-c1cc2nccc(-c3cccc(NC(=O)c4cccc(c4)C(F)(F)F)c3)n2n1