Reaction Details
TargetSerine/threonine-protein kinase B-raf
LigandBDBM50314058
Substrate/Competitorn/a
Meas. Tech.ChEMBL_626942 (CHEMBL1109830)
IC50 660±n/a nM
Citation Gopalsamy, ACiszewski, GShi, MBerger, DHu, YLee, FFeldberg, LFrommer, EKim, SCollins, KWojciechowicz, DMallon, R Hit to lead optimization of pyrazolo[1,5-a]pyrimidines as B-Raf kinase inhibitors. Bioorg Med Chem Lett19:6890-2 (2009) 
 
Serine/threonine-protein kinase B-raf
Name:Serine/threonine-protein kinase B-raf
Type:Serine/threonine-protein kinase
Mol. Mass.:84446.00
Organism:Homo sapiens (Human)
Description:P15056
Residue:766
BDBM50314058
NameBDBM50314058
Synonyms:3,4-dichloro-N-(3-(2-(pyridin-4-yl)pyrazolo[1,5-a]pyrimidin-7-yl)phenyl)benzamide | CHEMBL1090082
TypeSmall organic molecule
Emp. Form.C24H15Cl2N5O
Mol. Mass.460.315
SMILESClc1ccc(cc1Cl)C(=O)Nc1cccc(c1)-c1ccnc2cc(nn12)-c1ccncc1