Reaction Details
TargetSerine/threonine-protein kinase B-raf
LigandBDBM50314067
Substrate/Competitorn/a
Meas. Tech.ChEMBL_626942 (CHEMBL1109830)
IC50 110±n/a nM
Citation Gopalsamy, ACiszewski, GShi, MBerger, DHu, YLee, FFeldberg, LFrommer, EKim, SCollins, KWojciechowicz, DMallon, R Hit to lead optimization of pyrazolo[1,5-a]pyrimidines as B-Raf kinase inhibitors. Bioorg Med Chem Lett19:6890-2 (2009) 
 
Serine/threonine-protein kinase B-raf
Name:Serine/threonine-protein kinase B-raf
Type:Serine/threonine-protein kinase
Mol. Mass.:84446.00
Organism:Homo sapiens (Human)
Description:P15056
Residue:766
BDBM50314067
NameBDBM50314067
Synonyms:CHEMBL1091688 | N-(3-(2-(2-(3-(2-oxopyrrolidin-1-yl)propylamino)pyridin-4-yl)pyrazolo[1,5-a]pyrimidin-7-yl)phenyl)-3-(trifluoromethyl)benzamide
TypeSmall organic molecule
Emp. Form.C32H28F3N7O2
Mol. Mass.599.6056
SMILESFC(F)(F)c1cccc(c1)C(=O)Nc1cccc(c1)-c1ccnc2cc(nn12)-c1ccnc(NCCCN2CCCC2=O)c1