Reaction Details
TargetSphingosine 1-phosphate receptor 3
LigandBDBM50314403
Substrate/Competitorn/a
Meas. Tech.ChEMBL_624581 (CHEMBL1110630)
EC50 0.15±n/a nM
Citation Ma, BGuckian, KMLin, EYLee, WCScott, DKumaravel, GMacdonald, TLLynch, KRBlack, CChollate, SHahm, KHetu, GJin, PLuo, YRohde, ERossomando, AScannevin, RWang, JYang, C Stereochemistry-activity relationship of orally active tetralin S1P agonist prodrugs. Bioorg Med Chem Lett20:2264-9 (2010) 
 
Sphingosine 1-phosphate receptor 3
Name:Sphingosine 1-phosphate receptor 3
Type:G Protein-Coupled Receptor (GPCR)
Mol. Mass.:42278.13
Organism:Homo sapiens (Human)
Description:Q99500
Residue:378
BDBM50314403
NameBDBM50314403
Synonyms:(R)-2-amino-2-((R)-6-octyl-1,2,3,4-tetrahydronaphthalen-2-yl)propyl dihydrogen phosphate | CHEMBL1089004
TypeSmall organic molecule
Emp. Form.C21H36NO4P
Mol. Mass.397.4886
SMILESCCCCCCCCc1ccc2C[C@@H](CCc2c1)[C@@](C)(N)COP(O)(O)=O