Reaction Details
TargetSphingosine 1-phosphate receptor 1
LigandBDBM50314402
Substrate/Competitorn/a
Meas. Tech.ChEMBL_624582 (CHEMBL1110631)
EC50 1.79±n/a nM
Citation Ma, BGuckian, KMLin, EYLee, WCScott, DKumaravel, GMacdonald, TLLynch, KRBlack, CChollate, SHahm, KHetu, GJin, PLuo, YRohde, ERossomando, AScannevin, RWang, JYang, C Stereochemistry-activity relationship of orally active tetralin S1P agonist prodrugs. Bioorg Med Chem Lett20:2264-9 (2010) 
 
Sphingosine 1-phosphate receptor 1
Name:Sphingosine 1-phosphate receptor 1
Type:Enzyme
Mol. Mass.:42836.02
Organism:Homo sapiens (Human)
Description:P21453
Residue:382
BDBM50314402
NameBDBM50314402
Synonyms:(R)-2-amino-2-((S)-6-octyl-1,2,3,4-tetrahydronaphthalen-2-yl)propyl dihydrogen phosphate | CHEMBL1093686
TypeSmall organic molecule
Emp. Form.C21H36NO4P
Mol. Mass.397.4886
SMILESCCCCCCCCc1ccc2C[C@H](CCc2c1)[C@@](C)(N)COP(O)(O)=O