Reaction Details
TargetSphingosine 1-phosphate receptor 5
LigandBDBM23165
Substrate/Competitorn/a
Meas. Tech.ChEMBL_624586 (CHEMBL1111546)
EC50 0.36±n/a nM
Citation Ma, BGuckian, KMLin, EYLee, WCScott, DKumaravel, GMacdonald, TLLynch, KRBlack, CChollate, SHahm, KHetu, GJin, PLuo, YRohde, ERossomando, AScannevin, RWang, JYang, C Stereochemistry-activity relationship of orally active tetralin S1P agonist prodrugs. Bioorg Med Chem Lett20:2264-9 (2010) 
 
Sphingosine 1-phosphate receptor 5
Name:Sphingosine 1-phosphate receptor 5
Type:G Protein-Coupled Receptor (GPCR)
Mol. Mass.:41796.42
Organism:Homo sapiens (Human)
Description:n/a
Residue:398
BDBM23165
NameBDBM23165
Synonyms:CHEMBL366208 [(2S)-2-amino-3-hydroxy-2-[2-(4-octylphenyl)ethyl]propoxy]phosphonic acid
TypeSmall organic molecule
Emp. Form.C19H34NO5P
Mol. Mass.387.4507
SMILESCCCCCCCCc1ccc(CC[C@](N)(CO)COP(O)(O)=O)cc1