Reaction Details
TargetAcetyl-CoA carboxylase 1
LigandBDBM50314886
Substrate/Competitorn/a
Meas. Tech.ChEMBL_627703 (CHEMBL1115283)
IC50 17.5±n/a nM
Citation Corbett, JWFreeman-Cook, KDElliott, RVajdos, FRajamohan, FKohls, DMarr, EZhang, HTong, LTu, MMurdande, SDoran, SDHouser, JASong, WJones, CJCoffey, SBBuzon, LMinich, MLDirico, KJTapley, SMcPherson, RKSugarman, EHarwood, HJEsler, W Discovery of small molecule isozyme non-specific inhibitors of mammalian acetyl-CoA carboxylase 1 and 2. Bioorg Med Chem Lett20:2383-8 (2010) 
 
Acetyl-CoA carboxylase 1
Name:Acetyl-CoA carboxylase 1
Type:Protein
Mol. Mass.:265183.92
Organism:Rattus norvegicus (Rat)
Description:P11497
Residue:2345
BDBM50314886
NameBDBM50314886
Synonyms:1'-(7-ethyl-1H-indazole-5-carbonyl)-6,7-dimethylspiro[chroman-2,4'-piperidin]-4-one | CHEMBL1092307
TypeSmall organic molecule
Emp. Form.C25H27N3O3
Mol. Mass.417.5002
SMILESCCc1cc(cc2cn[nH]c12)C(=O)N1CCC2(CC1)CC(=O)c1cc(C)c(C)cc1O2