Reaction Details
TargetAcetyl-CoA carboxylase 2
LigandBDBM50314894
Substrate/Competitorn/a
Meas. Tech.ChEMBL_627704 (CHEMBL1115284)
IC50 11±n/a nM
Citation Corbett, JWFreeman-Cook, KDElliott, RVajdos, FRajamohan, FKohls, DMarr, EZhang, HTong, LTu, MMurdande, SDoran, SDHouser, JASong, WJones, CJCoffey, SBBuzon, LMinich, MLDirico, KJTapley, SMcPherson, RKSugarman, EHarwood, HJEsler, W Discovery of small molecule isozyme non-specific inhibitors of mammalian acetyl-CoA carboxylase 1 and 2. Bioorg Med Chem Lett20:2383-8 (2010) 
 
Acetyl-CoA carboxylase 2
Name:Acetyl-CoA carboxylase 2
Type:Protein
Mol. Mass.:276535.21
Organism:Homo sapiens (Human)
Description:O00763
Residue:2458
BDBM50314894
NameBDBM50314894
Synonyms:5-(5-methoxy-4-oxospiro[chroman-2,4'-piperidine]-1'-ylcarbonyl)-N-methyl-1H-indole-2-carboxamide | CHEMBL1089529
TypeSmall organic molecule
Emp. Form.C25H25N3O5
Mol. Mass.447.4831
SMILESCNC(=O)c1cc2cc(ccc2[nH]1)C(=O)N1CCC2(CC1)CC(=O)c1c(OC)cccc1O2