Reaction Details
TargetAcetyl-CoA carboxylase 2
LigandBDBM50314896
Substrate/Competitorn/a
Meas. Tech.ChEMBL_627704 (CHEMBL1115284)
IC50 16±n/a nM
Citation Corbett, JWFreeman-Cook, KDElliott, RVajdos, FRajamohan, FKohls, DMarr, EZhang, HTong, LTu, MMurdande, SDoran, SDHouser, JASong, WJones, CJCoffey, SBBuzon, LMinich, MLDirico, KJTapley, SMcPherson, RKSugarman, EHarwood, HJEsler, W Discovery of small molecule isozyme non-specific inhibitors of mammalian acetyl-CoA carboxylase 1 and 2. Bioorg Med Chem Lett20:2383-8 (2010) 
 
Acetyl-CoA carboxylase 2
Name:Acetyl-CoA carboxylase 2
Type:Protein
Mol. Mass.:276535.21
Organism:Homo sapiens (Human)
Description:O00763
Residue:2458
BDBM50314896
NameBDBM50314896
Synonyms:5-methoxy-1'-(2-phenyl-1H-benzo[d]imidazole-5-carbonyl)spiro[chroman-2,4'-piperidin]-4-one | CHEMBL1090863
TypeSmall organic molecule
Emp. Form.C28H25N3O4
Mol. Mass.467.5158
SMILESCOc1cccc2OC3(CCN(CC3)C(=O)c3ccc4nc([nH]c4c3)-c3ccccc3)CC(=O)c12