Reaction Details
TargetAcetyl-CoA carboxylase 1
LigandBDBM50314903
Substrate/Competitorn/a
Meas. Tech.ChEMBL_627703 (CHEMBL1115283)
IC50 7.4±n/a nM
Citation Corbett, JWFreeman-Cook, KDElliott, RVajdos, FRajamohan, FKohls, DMarr, EZhang, HTong, LTu, MMurdande, SDoran, SDHouser, JASong, WJones, CJCoffey, SBBuzon, LMinich, MLDirico, KJTapley, SMcPherson, RKSugarman, EHarwood, HJEsler, W Discovery of small molecule isozyme non-specific inhibitors of mammalian acetyl-CoA carboxylase 1 and 2. Bioorg Med Chem Lett20:2383-8 (2010) 
 
Acetyl-CoA carboxylase 1
Name:Acetyl-CoA carboxylase 1
Type:Protein
Mol. Mass.:265183.92
Organism:Rattus norvegicus (Rat)
Description:P11497
Residue:2345
BDBM50314903
NameBDBM50314903
Synonyms:1'-(7-methyl-1H-indazole-5-carbonyl)-6-(1H-pyrazol-4-yl)spiro[chroman-2,4'-piperidin]-4-one | CHEMBL1093187
TypeSmall organic molecule
Emp. Form.C25H23N5O3
Mol. Mass.441.4818
SMILESCc1cc(cc2cn[nH]c12)C(=O)N1CCC2(CC1)CC(=O)c1cc(ccc1O2)-c1cn[nH]c1