Reaction Details
TargetAcetyl-CoA carboxylase 2
LigandBDBM50314907
Substrate/Competitorn/a
Meas. Tech.ChEMBL_627704 (CHEMBL1115284)
IC50 7.6±n/a nM
Citation Corbett, JWFreeman-Cook, KDElliott, RVajdos, FRajamohan, FKohls, DMarr, EZhang, HTong, LTu, MMurdande, SDoran, SDHouser, JASong, WJones, CJCoffey, SBBuzon, LMinich, MLDirico, KJTapley, SMcPherson, RKSugarman, EHarwood, HJEsler, W Discovery of small molecule isozyme non-specific inhibitors of mammalian acetyl-CoA carboxylase 1 and 2. Bioorg Med Chem Lett20:2383-8 (2010) 
 
Acetyl-CoA carboxylase 2
Name:Acetyl-CoA carboxylase 2
Type:Protein
Mol. Mass.:276535.21
Organism:Homo sapiens (Human)
Description:O00763
Residue:2458
BDBM50314907
NameBDBM50314907
Synonyms:1'-(7-methyl-1H-indazole-5-carbonyl)-6-(5-methyl-1H-pyrazol-3-yl)spiro[chroman-2,4'-piperidin]-4-one | CHEMBL1088894
TypeSmall organic molecule
Emp. Form.C26H25N5O3
Mol. Mass.455.5084
SMILESCc1cc(n[nH]1)-c1ccc2OC3(CCN(CC3)C(=O)c3cc(C)c4[nH]ncc4c3)CC(=O)c2c1