Reaction Details
TargetAcetyl-CoA carboxylase 1
LigandBDBM50314924
Substrate/Competitorn/a
Meas. Tech.ChEMBL_627703 (CHEMBL1115283)
IC50 22±n/a nM
Citation Corbett, JWFreeman-Cook, KDElliott, RVajdos, FRajamohan, FKohls, DMarr, EZhang, HTong, LTu, MMurdande, SDoran, SDHouser, JASong, WJones, CJCoffey, SBBuzon, LMinich, MLDirico, KJTapley, SMcPherson, RKSugarman, EHarwood, HJEsler, W Discovery of small molecule isozyme non-specific inhibitors of mammalian acetyl-CoA carboxylase 1 and 2. Bioorg Med Chem Lett20:2383-8 (2010) 
 
Acetyl-CoA carboxylase 1
Name:Acetyl-CoA carboxylase 1
Type:Protein
Mol. Mass.:265183.92
Organism:Rattus norvegicus (Rat)
Description:P11497
Residue:2345
BDBM50314924
NameBDBM50314924
Synonyms:6,7-dimethyl-1'-(7-methyl-1H-indazole-5-carbonyl)spiro[chroman-2,4'-piperidin]-4-one | CHEMBL1091588
TypeSmall organic molecule
Emp. Form.C24H25N3O3
Mol. Mass.403.4736
SMILESCc1cc2OC3(CCN(CC3)C(=O)c3cc(C)c4[nH]ncc4c3)CC(=O)c2cc1C