Reaction Details
TargetAcetyl-CoA carboxylase 1
LigandBDBM50314928
Substrate/Competitorn/a
Meas. Tech.ChEMBL_627703 (CHEMBL1115283)
IC50 17±n/a nM
Citation Corbett, JWFreeman-Cook, KDElliott, RVajdos, FRajamohan, FKohls, DMarr, EZhang, HTong, LTu, MMurdande, SDoran, SDHouser, JASong, WJones, CJCoffey, SBBuzon, LMinich, MLDirico, KJTapley, SMcPherson, RKSugarman, EHarwood, HJEsler, W Discovery of small molecule isozyme non-specific inhibitors of mammalian acetyl-CoA carboxylase 1 and 2. Bioorg Med Chem Lett20:2383-8 (2010) 
 
Acetyl-CoA carboxylase 1
Name:Acetyl-CoA carboxylase 1
Type:Protein
Mol. Mass.:265183.92
Organism:Rattus norvegicus (Rat)
Description:P11497
Residue:2345
BDBM50314928
NameBDBM50314928
Synonyms:1'-(7-methyl-1H-indazole-5-carbonyl)-6-(2-methyloxazol-5-yl)spiro[chroman-2,4'-piperidin]-4-one | CHEMBL1089547
TypeSmall organic molecule
Emp. Form.C26H24N4O4
Mol. Mass.456.4932
SMILESCc1ncc(o1)-c1ccc2OC3(CCN(CC3)C(=O)c3cc(C)c4[nH]ncc4c3)CC(=O)c2c1