Reaction Details
TargetAcetyl-CoA carboxylase 2
LigandBDBM50314932
Substrate/Competitorn/a
Meas. Tech.ChEMBL_627704 (CHEMBL1115284)
IC50 0.31±n/a nM
Citation Corbett, JWFreeman-Cook, KDElliott, RVajdos, FRajamohan, FKohls, DMarr, EZhang, HTong, LTu, MMurdande, SDoran, SDHouser, JASong, WJones, CJCoffey, SBBuzon, LMinich, MLDirico, KJTapley, SMcPherson, RKSugarman, EHarwood, HJEsler, W Discovery of small molecule isozyme non-specific inhibitors of mammalian acetyl-CoA carboxylase 1 and 2. Bioorg Med Chem Lett20:2383-8 (2010) 
 
Acetyl-CoA carboxylase 2
Name:Acetyl-CoA carboxylase 2
Type:Protein
Mol. Mass.:276535.21
Organism:Homo sapiens (Human)
Description:O00763
Residue:2458
BDBM50314932
NameBDBM50314932
Synonyms:6'-methoxy-1-(7-methyl-1H-indazole-5-carbonyl)spiro[piperidine-4,2'-pyrano[2,3-c]pyridin]-4'(3'H)-one | CHEMBL1091996
TypeSmall organic molecule
Emp. Form.C22H22N4O4
Mol. Mass.406.4345
SMILESCOc1cc2C(=O)CC3(CCN(CC3)C(=O)c3cc(C)c4[nH]ncc4c3)Oc2cn1