Reaction Details
TargetTyrosine-protein kinase ABL1
LigandBDBM50315231
Substrate/Competitorn/a
Meas. Tech.ChEMBL_625447 (CHEMBL1116996)
IC50 80±n/a nM
Citation Pissot-Soldermann, CGerspacher, MFuret, PGaul, CHolzer, PMcCarthy, CRadimerski, TRegnier, CHBaffert, FDrueckes, PTavares, GAVangrevelinghe, EBlasco, FOttaviani, GOssola, FScesa, JReetz, J Discovery and SAR of potent, orally available 2,8-diaryl-quinoxalines as a new class of JAK2 inhibitors. Bioorg Med Chem Lett20:2609-13 (2010) 
 
Tyrosine-protein kinase ABL1
Name:Tyrosine-protein kinase ABL1
Type:Enzyme
Mol. Mass.:122897.30
Organism:Homo sapiens (Human)
Description:P00519
Residue:1130
BDBM50315231
NameBDBM50315231
Synonyms:4-(2,6-difluoro-4-(3-(1-(piperidin-4-yl)-1H-pyrazol-4-yl)quinoxalin-5-yl)benzyl)morpholine CHEMBL1092926
TypeSmall organic molecule
Emp. Form.C27H28F2N6O
Mol. Mass.490.5476
SMILESFc1cc(cc(F)c1CN1CCOCC1)-c1cccc2ncc(nc12)-c1cnn(c1)C1CCNCC1