Reaction Details
TargetNon-receptor tyrosine-protein kinase TYK2
LigandBDBM50315237
Substrate/Competitorn/a
Meas. Tech.ChEMBL_625437 (CHEMBL1116986)
IC50 94±n/a nM
Citation Pissot-Soldermann, CGerspacher, MFuret, PGaul, CHolzer, PMcCarthy, CRadimerski, TRegnier, CHBaffert, FDrueckes, PTavares, GAVangrevelinghe, EBlasco, FOttaviani, GOssola, FScesa, JReetz, J Discovery and SAR of potent, orally available 2,8-diaryl-quinoxalines as a new class of JAK2 inhibitors. Bioorg Med Chem Lett20:2609-13 (2010) 
 
Non-receptor tyrosine-protein kinase TYK2
Name:Non-receptor tyrosine-protein kinase TYK2
Type:Protein
Mol. Mass.:133666.03
Organism:Homo sapiens (Human)
Description:P29597
Residue:1187
BDBM50315237
NameBDBM50315237
Synonyms:4-(2,6-difluoro-4-(3-(4-(4-methylpiperazin-1-yl)phenyl)quinoxalin-5-yl)benzyl)morpholine | CHEMBL1089773
TypeSmall organic molecule
Emp. Form.C30H31F2N5O
Mol. Mass.515.5968
SMILESCN1CCN(CC1)c1ccc(cc1)-c1cnc2cccc(-c3cc(F)c(CN4CCOCC4)c(F)c3)c2n1