Reaction Details
TargetTyrosine-protein kinase JAK1
LigandBDBM50315236
Substrate/Competitorn/a
Meas. Tech.ChEMBL_625434 (CHEMBL1116983)
IC50 60±n/a nM
Citation Pissot-Soldermann, CGerspacher, MFuret, PGaul, CHolzer, PMcCarthy, CRadimerski, TRegnier, CHBaffert, FDrueckes, PTavares, GAVangrevelinghe, EBlasco, FOttaviani, GOssola, FScesa, JReetz, J Discovery and SAR of potent, orally available 2,8-diaryl-quinoxalines as a new class of JAK2 inhibitors. Bioorg Med Chem Lett20:2609-13 (2010) 
 
Tyrosine-protein kinase JAK1
Name:Tyrosine-protein kinase JAK1
Type:Protein
Mol. Mass.:133293.73
Organism:Homo sapiens (Human)
Description:P23458
Residue:1154
BDBM50315236
NameBDBM50315236
Synonyms:(4-(8-(3,5-difluoro-4-(morpholinomethyl)phenyl)quinoxalin-2-yl)-2-methylphenyl)(morpholino)methanone | CHEMBL1093119
TypeSmall organic molecule
Emp. Form.C31H30F2N4O3
Mol. Mass.544.5917
SMILESCc1cc(ccc1C(=O)N1CCOCC1)-c1cnc2cccc(-c3cc(F)c(CN4CCOCC4)c(F)c3)c2n1