Reaction Details
TargetTyrosine-protein kinase JAK2
LigandBDBM50315241
Substrate/Competitorn/a
Meas. Tech.ChEMBL_625435 (CHEMBL1116984)
IC50 14±n/a nM
Citation Pissot-Soldermann, CGerspacher, MFuret, PGaul, CHolzer, PMcCarthy, CRadimerski, TRegnier, CHBaffert, FDrueckes, PTavares, GAVangrevelinghe, EBlasco, FOttaviani, GOssola, FScesa, JReetz, J Discovery and SAR of potent, orally available 2,8-diaryl-quinoxalines as a new class of JAK2 inhibitors. Bioorg Med Chem Lett20:2609-13 (2010) 
 
Tyrosine-protein kinase JAK2
Name:Tyrosine-protein kinase JAK2
Type:Protein
Mol. Mass.:130684.68
Organism:Homo sapiens (Human)
Description:O60674
Residue:1132
BDBM50315241
NameBDBM50315241
Synonyms:8-[4-(1,1-Dioxo-1lambda*6*-thiomorpholin-4-ylmethyl)-phenyl]-2-(3,4,5-trimethoxy-phenyl)-quinoxaline | CHEMBL1089833
TypeSmall organic molecule
Emp. Form.C28H29N3O5S
Mol. Mass.519.612
SMILESCOc1cc(cc(OC)c1OC)-c1cnc2cccc(-c3ccc(CN4CCS(=O)(=O)CC4)cc3)c2n1