Reaction Details
TargetTyrosine-protein kinase JAK2
LigandBDBM50315243
Substrate/Competitorn/a
Meas. Tech.ChEMBL_625435 (CHEMBL1116984)
IC50 101±n/a nM
Citation Pissot-Soldermann, CGerspacher, MFuret, PGaul, CHolzer, PMcCarthy, CRadimerski, TRegnier, CHBaffert, FDrueckes, PTavares, GAVangrevelinghe, EBlasco, FOttaviani, GOssola, FScesa, JReetz, J Discovery and SAR of potent, orally available 2,8-diaryl-quinoxalines as a new class of JAK2 inhibitors. Bioorg Med Chem Lett20:2609-13 (2010) 
 
Tyrosine-protein kinase JAK2
Name:Tyrosine-protein kinase JAK2
Type:Protein
Mol. Mass.:130684.68
Organism:Homo sapiens (Human)
Description:O60674
Residue:1132
BDBM50315243
NameBDBM50315243
Synonyms:2-(4-(7-fluoro-3-(3,4,5-trimethoxyphenyl)quinoxalin-5-yl)phenyl)-1-morpholinoethanone | CHEMBL1091191
TypeSmall organic molecule
Emp. Form.C29H28FN3O5
Mol. Mass.517.5481
SMILESCOc1cc(cc(OC)c1OC)-c1cnc2cc(F)cc(-c3ccc(CC(=O)N4CCOCC4)cc3)c2n1