Reaction Details
TargetTyrosine-protein kinase JAK2
LigandBDBM50315246
Substrate/Competitorn/a
Meas. Tech.ChEMBL_625435 (CHEMBL1116984)
IC50 195±n/a nM
Citation Pissot-Soldermann, CGerspacher, MFuret, PGaul, CHolzer, PMcCarthy, CRadimerski, TRegnier, CHBaffert, FDrueckes, PTavares, GAVangrevelinghe, EBlasco, FOttaviani, GOssola, FScesa, JReetz, J Discovery and SAR of potent, orally available 2,8-diaryl-quinoxalines as a new class of JAK2 inhibitors. Bioorg Med Chem Lett20:2609-13 (2010) 
 
Tyrosine-protein kinase JAK2
Name:Tyrosine-protein kinase JAK2
Type:Protein
Mol. Mass.:130684.68
Organism:Homo sapiens (Human)
Description:O60674
Residue:1132
BDBM50315246
NameBDBM50315246
Synonyms:4-(2-methyl-4-(3-(3,4,5-trimethoxyphenyl)quinoxalin-5-yl)benzyl)morpholine | CHEMBL1093454
TypeSmall organic molecule
Emp. Form.C29H31N3O4
Mol. Mass.485.5741
SMILESCOc1cc(cc(OC)c1OC)-c1cnc2cccc(-c3ccc(CN4CCOCC4)c(C)c3)c2n1