Reaction Details
TargetNon-receptor tyrosine-protein kinase TYK2
LigandBDBM50315240
Substrate/Competitorn/a
Meas. Tech.ChEMBL_625437 (CHEMBL1116986)
IC50 340±n/a nM
Citation Pissot-Soldermann, CGerspacher, MFuret, PGaul, CHolzer, PMcCarthy, CRadimerski, TRegnier, CHBaffert, FDrueckes, PTavares, GAVangrevelinghe, EBlasco, FOttaviani, GOssola, FScesa, JReetz, J Discovery and SAR of potent, orally available 2,8-diaryl-quinoxalines as a new class of JAK2 inhibitors. Bioorg Med Chem Lett20:2609-13 (2010) 
 
Non-receptor tyrosine-protein kinase TYK2
Name:Non-receptor tyrosine-protein kinase TYK2
Type:Protein
Mol. Mass.:133666.03
Organism:Homo sapiens (Human)
Description:P29597
Residue:1187
BDBM50315240
NameBDBM50315240
Synonyms:1-(1,1-Dioxo-1lambda*6*-thiomorpholin-4-yl)-2-{4-[3-(3,4,5-trimethoxy-phenyl)-quinoxalin-5-yl]-phenyl}-ethanone | CHEMBL1093468
TypeSmall organic molecule
Emp. Form.C29H29N3O6S
Mol. Mass.547.622
SMILESCOc1cc(cc(OC)c1OC)-c1cnc2cccc(-c3ccc(CC(=O)N4CCS(=O)(=O)CC4)cc3)c2n1