Reaction Details
TargetC-X-C chemokine receptor type 4
LigandBDBM50315303
Substrate/Competitorn/a
Meas. Tech.ChEMBL_626233 (CHEMBL1108000)
IC50 120±n/a nM
Citation Skerlj, RTBridger, GJKaller, AMcEachern, EJCrawford, JBZhou, YAtsma, BLangille, JNan, SVeale, DWilson, THarwig, CHatse, SPrincen, KDe Clercq, ESchols, D Discovery of novel small molecule orally bioavailable C-X-C chemokine receptor 4 antagonists that are potent inhibitors of T-tropic (X4) HIV-1 replication. J Med Chem53:3376-88 (2010) 
 
C-X-C chemokine receptor type 4
Name:C-X-C chemokine receptor type 4
Type:Enzyme
Mol. Mass.:39754.61
Organism:Homo sapiens (Human)
Description:P61073
Residue:352
BDBM50315303
NameBDBM50315303
Synonyms:(S)-N-(2-Pyridinylmethyl)-N'-(1H-benzimidazol-2-ylmethyl)-N'-(5,6,7,8-tetrahydro-8-quinolinyl)-1,4-benzenedimethanamine | CHEMBL1093137
TypeSmall organic molecule
Emp. Form.C31H32N6
Mol. Mass.488.626
SMILESC(NCc1ccccn1)c1ccc(CN(Cc2nc3ccccc3[nH]2)[C@H]2CCCc3cccnc23)cc1