Reaction Details
TargetSphingosine 1-phosphate receptor 3
LigandBDBM50315805
Substrate/Competitorn/a
Meas. Tech.ChEMBL_626104 (CHEMBL1111630)
EC50>1000±n/a nM
Citation Hamada, MNakamura, MKiuchi, MMarukawa, KTomatsu, AShimano, KSato, NSugahara, KAsayama, MTakagi, KAdachi, K Removal of sphingosine 1-phosphate receptor-3 (S1P(3)) agonism is essential, but inadequate to obtain immunomodulating 2-aminopropane-1,3-diol S1P(1) agonists with reduced effect on heart rate. J Med Chem53:3154-68 (2010) 
 
Sphingosine 1-phosphate receptor 3
Name:Sphingosine 1-phosphate receptor 3
Type:G Protein-Coupled Receptor (GPCR)
Mol. Mass.:42278.13
Organism:Homo sapiens (Human)
Description:Q99500
Residue:378
BDBM50315805
NameBDBM50315805
Synonyms:2-amino-4-(4'-butoxybiphenyl-4-yl)-2-(hydroxymethyl)butyl dihydrogen phosphate | CHEMBL1096211
TypeSmall organic molecule
Emp. Form.C21H30NO6P
Mol. Mass.423.4398
SMILESCCCCOc1ccc(cc1)-c1ccc(CCC(N)(CO)COP(O)(O)=O)cc1