Reaction Details
TargetReceptor tyrosine-protein kinase erbB-2
LigandBDBM50315886
Substrate/Competitorn/a
Meas. Tech.ChEMBL_624977 (CHEMBL1108833)
IC50 55±n/a nM
Citation Fidanze, SDErickson, SAWang, GTMantei, RClark, RFSorensen, BKBamaung, NYKovar, PJohnson, EFSwinger, KKStewart, KDZhang, QTucker, LAPappano, WNWilsbacher, JLWang, JSheppard, GSBell, RLDavidsen, SKHubbard, RD Imidazo[2,1-b]thiazoles: multitargeted inhibitors of both the insulin-like growth factor receptor and members of the epidermal growth factor family of receptor tyrosine kinases. Bioorg Med Chem Lett20:2452-5 (2010) 
 
Receptor tyrosine-protein kinase erbB-2
Name:Receptor tyrosine-protein kinase erbB-2
Type:n/a
Mol. Mass.:137894.47
Organism:Homo sapiens (Human)
Description:P04626
Residue:1255
BDBM50315886
NameBDBM50315886
Synonyms:2-phenyl-N-(3-(5-(2-(1,2,3,4-tetrahydroisoquinolin-6-ylamino)pyrimidin-4-yl)imidazo[2,1-b]thiazol-6-yl)phenyl)acetamide | CHEMBL1090364
TypeSmall organic molecule
Emp. Form.C32H27N7OS
Mol. Mass.557.668
SMILESO=C(Cc1ccccc1)Nc1cccc(c1)-c1nc2sccn2c1-c1ccnc(Nc2ccc3CNCCc3c2)n1