Reaction Details
TargetInsulin-like growth factor 1 receptor
LigandBDBM50315896
Substrate/Competitorn/a
Meas. Tech.ChEMBL_624976 (CHEMBL1108832)
IC50 200±n/a nM
Citation Fidanze, SDErickson, SAWang, GTMantei, RClark, RFSorensen, BKBamaung, NYKovar, PJohnson, EFSwinger, KKStewart, KDZhang, QTucker, LAPappano, WNWilsbacher, JLWang, JSheppard, GSBell, RLDavidsen, SKHubbard, RD Imidazo[2,1-b]thiazoles: multitargeted inhibitors of both the insulin-like growth factor receptor and members of the epidermal growth factor family of receptor tyrosine kinases. Bioorg Med Chem Lett20:2452-5 (2010) 
 
Insulin-like growth factor 1 receptor
Name:Insulin-like growth factor 1 receptor
Type:Protein
Mol. Mass.:154776.79
Organism:Homo sapiens (Human)
Description:P08069
Residue:1367
BDBM50315896
NameBDBM50315896
Synonyms:CHEMBL1090358 | N-(3-(5-(2-(4-(4-ethylpiperazin-1-yl)phenylamino)pyrimidin-4-yl)imidazo[2,1-b]thiazol-6-yl)phenyl)-2,6-difluorobenzamide
TypeSmall organic molecule
Emp. Form.C34H30F2N8OS
Mol. Mass.636.717
SMILESCCN1CCN(CC1)c1ccc(Nc2nccc(n2)-c2c(nc3sccn23)-c2cccc(NC(=O)c3c(F)cccc3F)c2)cc1