Reaction Details
TargetReceptor tyrosine-protein kinase erbB-2
LigandBDBM50315904
Substrate/Competitorn/a
Meas. Tech.ChEMBL_624977 (CHEMBL1108833)
IC50 6000±n/a nM
Citation Fidanze, SDErickson, SAWang, GTMantei, RClark, RFSorensen, BKBamaung, NYKovar, PJohnson, EFSwinger, KKStewart, KDZhang, QTucker, LAPappano, WNWilsbacher, JLWang, JSheppard, GSBell, RLDavidsen, SKHubbard, RD Imidazo[2,1-b]thiazoles: multitargeted inhibitors of both the insulin-like growth factor receptor and members of the epidermal growth factor family of receptor tyrosine kinases. Bioorg Med Chem Lett20:2452-5 (2010) 
 
Receptor tyrosine-protein kinase erbB-2
Name:Receptor tyrosine-protein kinase erbB-2
Type:n/a
Mol. Mass.:137894.47
Organism:Homo sapiens (Human)
Description:P04626
Residue:1255
BDBM50315904
NameBDBM50315904
Synonyms:4-(6-(3-nitrophenyl)imidazo[2,1-b]thiazol-5-yl)-N-phenylpyrimidin-2-amine | CHEMBL1093235
TypeSmall organic molecule
Emp. Form.C21H14N6O2S
Mol. Mass.414.44
SMILES[O-][N+](=O)c1cccc(c1)-c1nc2sccn2c1-c1ccnc(Nc2ccccc2)n1