Reaction Details
Target3-phosphoinositide-dependent protein kinase 1
LigandBDBM50316342
Substrate/Competitorn/a
Meas. Tech.ChEMBL_627903 (CHEMBL1103719)
IC50 5±n/a nM
Citation Nittoli, TDushin, RGIngalls, CCheung, KFloyd, MBFraser, HOlland, AHu, YGrosu, GHan, XArndt, KGuo, BWissner, A The identification of 8,9-dimethoxy-5-(2-aminoalkoxy-pyridin-3-yl)-benzo[c][2,7]naphthyridin-4-ylamines as potent inhibitors of 3-phosphoinositide-dependent kinase-1 (PDK-1). Eur J Med Chem45:1379-86 (2010) 
 
3-phosphoinositide-dependent protein kinase 1
Name:3-phosphoinositide-dependent protein kinase 1
Type:Enzyme
Mol. Mass.:63157.65
Organism:Homo sapiens (Human)
Description:O15530
Residue:556
BDBM50316342
NameBDBM50316342
Synonyms:2-[5-(2-Aminoethoxy)pyridin-3-yl]-8,9-dimethoxybenzo[c]-2,7-naphthyridin-4-amine | CHEMBL1095278
TypeSmall organic molecule
Emp. Form.C21H21N5O3
Mol. Mass.391.4231
SMILESCOc1cc2ncc3c(N)nc(cc3c2cc1OC)-c1cncc(OCCN)c1