Reaction Details
TargetGlutamate receptor 1
LigandBDBM50002370
Substrate/Competitorn/a
Meas. Tech.ChEMBL_628001 (CHEMBL1105522)
EC50 53000±n/a nM
Citation Fleming, JJEngland, PM Developing a complete pharmacology for AMPA receptors: a perspective on subtype-selective ligands. Bioorg Med Chem18:1381-7 (2010) 
 
Glutamate receptor 1
Name:Glutamate receptor 1
Type:Protein
Mol. Mass.:101583.91
Organism:Rattus norvegicus (Rat)
Description:P19490
Residue:907
BDBM50002370
NameBDBM50002370
Synonyms:(R,S)-alpha-amino-3-hydroxy-5-methyl-4-isooxazole-propionic acid 2-Amino-3-(3-hydroxy-5-methyl-isoxazol-4-yl)-propionic acid 2-amino-3-(3-hydroxy-5-methyl-4-isoxazolyl)-propionic acid 2-ammonio-3-(3-hydroxy-5-methylisoxazol-4-yl)propanoate CHEMBL13378
TypeSmall organic molecule
Emp. Form.C7H10N2O4
Mol. Mass.186.1653
SMILESCc1o[nH]c(=O)c1CC(N)C(O)=O