Reaction Details
Target6,7-dimethyl-8-ribityllumazine synthase
LigandBDBM50316576
Substrate/Competitorn/a
Meas. Tech.ChEMBL_631473 (CHEMBL1114707)
Ki 518000±n/a nM
Citation Talukdar, AMorgunova, EDuan, JMeining, WFoloppe, NNilsson, LBacher, AIllarionov, BFischer, MLadenstein, RCushman, M Virtual screening, selection and development of a benzindolone structural scaffold for inhibition of lumazine synthase. Bioorg Med Chem18:3518-34 (2010) 
 
6,7-dimethyl-8-ribityllumazine synthase
Name:6,7-dimethyl-8-ribityllumazine synthase
Type:PROTEIN
Mol. Mass.:16367.39
Organism:Mycobacterium tuberculosis
Description:ChEMBL_631469
Residue:160
BDBM50316576
NameBDBM50316576
Synonyms:1,1-difluoro-5-(2-oxo-1,2-dihydrobenzo[cd]indole-6-sulfonamido)pentylphosphonic acid | CHEMBL1096338
TypeSmall organic molecule
Emp. Form.C16H17F2N2O6PS
Mol. Mass.434.352
SMILESOP(O)(=O)C(F)(F)CCCCNS(=O)(=O)c1ccc2NC(=O)c3cccc1c23