Reaction Details
TargetC-X-C chemokine receptor type 4
LigandBDBM50315287
Substrate/Competitorn/a
Meas. Tech.ChEMBL_632017 (CHEMBL1110059)
IC50 36±n/a nM
Citation Miller, JFGudmundsson, KSD'Aurora Richardson, LJenkinson, SSpaltenstein, AThomson, MWheelan, P Synthesis and SAR of novel isoquinoline CXCR4 antagonists with potent anti-HIV activity. Bioorg Med Chem Lett20:3026-30 (2010) 
 
C-X-C chemokine receptor type 4
Name:C-X-C chemokine receptor type 4
Type:Enzyme
Mol. Mass.:39754.61
Organism:Homo sapiens (Human)
Description:P61073
Residue:352
BDBM50315287
NameBDBM50315287
Synonyms:(R)-N1-((1H-benzo[d]imidazol-2-yl)methyl)-N1-(5,6,7,8-tetrahydroquinolin-8-yl)butane-1,4-diamine | CHEMBL1093149
TypeSmall organic molecule
Emp. Form.C21H27N5
Mol. Mass.349.4726
SMILESNCCCCN(Cc1nc2ccccc2[nH]1)[C@@H]1CCCc2cccnc12