Reaction Details
Target5-hydroxytryptamine receptor 1A
LigandBDBM50316686
Substrate/Competitorn/a
Meas. Tech.ChEMBL_632234 (CHEMBL1110096)
IC50 30±n/a nM
Citation Childers, WEHavran, LMAsselin, MBicksler, JJChong, DCGrosu, GTShen, ZAbou-Gharbia, MABach, ACHarrison, BLKagan, NKleintop, TMagolda, RMarathias, VRobichaud, AJSabb, ALZhang, MYAndree, THAschmies, SHBeyer, CComery, TADay, MGrauer, SMHughes, ZARosenzweig-Lipson, SPlatt, BPulicicchio, CSmith, DESukoff-Rizzo, SJSullivan, KMAdedoyin, AHuselton, CHirst, WD The synthesis and biological evaluation of quinolyl-piperazinyl piperidines as potent serotonin 5-HT1A antagonists. J Med Chem53:4066-84 (2010) 
 
5-hydroxytryptamine receptor 1A
Name:5-hydroxytryptamine receptor 1A
Type:n/a
Mol. Mass.:46122.49
Organism:Homo sapiens (Human)
Description:n/a
Residue:422
BDBM50316686
NameBDBM50316686
Synonyms:8-{4-[4-(6-Methoxyquinolin-8-yl)piperazin-1-yl]piperidin-1-yl}-3-(trifluoromethyl)Quinoline | CHEMBL1094557
TypeSmall organic molecule
Emp. Form.C29H30F3N5O
Mol. Mass.521.5766
SMILESCOc1cc(N2CCN(CC2)C2CCN(CC2)c2cccc3cc(cnc23)C(F)(F)F)c2ncccc2c1