Reaction Details
TargetAdenosine receptor A1
LigandBDBM50316887
Substrate/Competitorn/a
Meas. Tech.ChEMBL_629846 (CHEMBL1116483)
Ki 48.2±n/a nM
Citation Shook, BCRassnick, SChakravarty, DWallace, NAult, MCrooke, JBarbay, JKWang, ALeonard, KPowell, MTAlford, VHall, DRupert, KCHeintzelman, GRHansen, KBullington, JLScannevin, RHCarroll, KLampron, LWestover, LRussell, RBranum, SWells, KDamon, SYouells, SBeauchamp, DLi, XRhodes, KJackson, PF Optimization of arylindenopyrimidines as potent adenosine A(2A)/A(1) antagonists. Bioorg Med Chem Lett20:2868-71 (2010) 
 
Adenosine receptor A1
Name:Adenosine receptor A1
Type:G Protein-Coupled Receptor (GPCR)
Mol. Mass.:36520.92
Organism:Homo sapiens (Human)
Description:P30542
Residue:326
BDBM50316887
NameBDBM50316887
Synonyms:2-amino-8-(2-morpholinoethoxy)-4-phenyl-5H-indeno[1,2-d]pyrimidin-5-one | CHEMBL1095488
TypeSmall organic molecule
Emp. Form.C23H22N4O3
Mol. Mass.402.4458
SMILESNc1nc2-c3cc(OCCN4CCOCC4)ccc3C(=O)c2c(n1)-c1ccccc1