Reaction Details
TargetAdenosine receptor A1
LigandBDBM50316893
Substrate/Competitorn/a
Meas. Tech.ChEMBL_629846 (CHEMBL1116483)
Ki 15.4±n/a nM
Citation Shook, BCRassnick, SChakravarty, DWallace, NAult, MCrooke, JBarbay, JKWang, ALeonard, KPowell, MTAlford, VHall, DRupert, KCHeintzelman, GRHansen, KBullington, JLScannevin, RHCarroll, KLampron, LWestover, LRussell, RBranum, SWells, KDamon, SYouells, SBeauchamp, DLi, XRhodes, KJackson, PF Optimization of arylindenopyrimidines as potent adenosine A(2A)/A(1) antagonists. Bioorg Med Chem Lett20:2868-71 (2010) 
 
Adenosine receptor A1
Name:Adenosine receptor A1
Type:G Protein-Coupled Receptor (GPCR)
Mol. Mass.:36520.92
Organism:Homo sapiens (Human)
Description:P30542
Residue:326
BDBM50316893
NameBDBM50316893
Synonyms:2-amino-4-phenyl-8-(2-(pyridin-2-yl)ethylamino)-5H-indeno[1,2-d]pyrimidin-5-one | CHEMBL1098765
TypeSmall organic molecule
Emp. Form.C24H19N5O
Mol. Mass.393.4406
SMILESNc1nc2-c3cc(NCCc4ccccn4)ccc3C(=O)c2c(n1)-c1ccccc1