Reaction Details
TargetAdenosine receptor A2a
LigandBDBM50316870
Substrate/Competitorn/a
Meas. Tech.ChEMBL_629845 (CHEMBL1116482)
Ki 7.8±n/a nM
Citation Shook, BCRassnick, SChakravarty, DWallace, NAult, MCrooke, JBarbay, JKWang, ALeonard, KPowell, MTAlford, VHall, DRupert, KCHeintzelman, GRHansen, KBullington, JLScannevin, RHCarroll, KLampron, LWestover, LRussell, RBranum, SWells, KDamon, SYouells, SBeauchamp, DLi, XRhodes, KJackson, PF Optimization of arylindenopyrimidines as potent adenosine A(2A)/A(1) antagonists. Bioorg Med Chem Lett20:2868-71 (2010) 
 
Adenosine receptor A2a
Name:Adenosine receptor A2a
Type:G Protein-Coupled Receptor (GPCR)
Mol. Mass.:44716.46
Organism:Homo sapiens (Human)
Description:P29274
Residue:412
BDBM50316870
NameBDBM50316870
Synonyms:2-amino-N-(2-(diethylamino)ethyl)-N-methyl-5-oxo-4-phenyl-5H-indeno[1,2-d]pyrimidine-8-carboxamide | CHEMBL1088260
TypeSmall organic molecule
Emp. Form.C25H27N5O2
Mol. Mass.429.5142
SMILESCCN(CC)CCN(C)C(=O)c1ccc2C(=O)c3c(nc(N)nc3-c3ccccc3)-c2c1