Reaction Details
TargetD(2) dopamine receptor
LigandBDBM50316952
Substrate/Competitorn/a
Meas. Tech.ChEMBL_630105 (CHEMBL1110025)
Ki 2.5±n/a nM
Citation Yan, YZhou, PRotella, DPFeenstra, RKruse, CGReinders, JHvan der Neut, MLai, MZhang, JKowal, DMCarrick, TMarquis, KLPausch, MHRobichaud, AJ Potent dihydroquinolinone dopamine D2 partial agonist/serotonin reuptake inhibitors for the treatment of schizophrenia. Bioorg Med Chem Lett20:2983-6 (2010) 
 
D(2) dopamine receptor
Name:D(2) dopamine receptor
Type:Cell-surface receptors
Mol. Mass.:50647.10
Organism:Homo sapiens (Human)
Description:P14416
Residue:443
BDBM50316952
NameBDBM50316952
Synonyms:(R)-3-((4-(2-oxo-1,2,3,4-tetrahydroquinolin-7-yloxy)piperidin-1-yl)methyl)-7,9-dihydro-2H-[1,4]dioxino[2,3-e]indol-8(3H)-one | CHEMBL1087744
TypeSmall organic molecule
Emp. Form.C25H27N3O5
Mol. Mass.449.499
SMILESO=C1Cc2c(N1)ccc1O[C@H](CN3CCC(CC3)Oc3ccc4CCC(=O)Nc4c3)COc21