Reaction Details
TargetBeta-secretase 1
LigandBDBM50317057
Substrate/Competitorn/a
Meas. Tech.ChEMBL_630343 (CHEMBL1109090)
IC50 70±n/a nM
Citation Cumming, JBabu, SHuang, YCarrol, CChen, XFavreau, LGreenlee, WGuo, TKennedy, MKuvelkar, RLe, TLi, GMcHugh, NOrth, POzgur, LParker, ESaionz, KStamford, AStrickland, CTadesse, DVoigt, JZhang, LZhang, Q Piperazine sulfonamide BACE1 inhibitors: design, synthesis, and in vivo characterization. Bioorg Med Chem Lett20:2837-42 (2010) 
 
Beta-secretase 1
Name:Beta-secretase 1
Type:Protein
Mol. Mass.:55755.10
Organism:Homo sapiens (Human)
Description:P56817
Residue:501
BDBM50317057
NameBDBM50317057
Synonyms:CHEMBL1097350 | N-((1S,2S)-3-(3,5-difluorophenyl)-1-hydroxy-1-((R)-4-(pyridin-2-ylsulfonyl)piperazin-2-yl)propan-2-yl)-3-((R)-2-(methoxymethyl)pyrrolidine-1-carbonyl)-5-methylbenzamide
TypeSmall organic molecule
Emp. Form.C33H39F2N5O6S
Mol. Mass.671.754
SMILESCOC[C@H]1CCCN1C(=O)c1cc(C)cc(c1)C(=O)N[C@@H](Cc1cc(F)cc(F)c1)[C@H](O)[C@H]1CN(CCN1)S(=O)(=O)c1ccccn1