Reaction Details
TargetBeta-secretase 1
LigandBDBM50317050
Substrate/Competitorn/a
Meas. Tech.ChEMBL_630324 (CHEMBL1109071)
Ki 1±n/a nM
Citation Cumming, JBabu, SHuang, YCarrol, CChen, XFavreau, LGreenlee, WGuo, TKennedy, MKuvelkar, RLe, TLi, GMcHugh, NOrth, POzgur, LParker, ESaionz, KStamford, AStrickland, CTadesse, DVoigt, JZhang, LZhang, Q Piperazine sulfonamide BACE1 inhibitors: design, synthesis, and in vivo characterization. Bioorg Med Chem Lett20:2837-42 (2010) 
 
Beta-secretase 1
Name:Beta-secretase 1
Type:Protein
Mol. Mass.:55755.10
Organism:Homo sapiens (Human)
Description:P56817
Residue:501
BDBM50317050
NameBDBM50317050
Synonyms:1-N-[(1S,2S)-3-(3,5-difluorophenyl)-1-hydroxy-1-[(2R)-4-[(3-methylbenzene)sulfonyl]piperazin-2-yl]propan-2-yl]-5-(1,1-dioxo-1,2-thiazinan-2-yl)-3-N-[(1R)-1-phenylethyl]benzene-1,3-dicarboxamide | CHEMBL1097344
TypeSmall organic molecule
Emp. Form.C40H45F2N5O7S2
Mol. Mass.809.941
SMILESC[C@@H](NC(=O)c1cc(cc(c1)C(=O)N[C@@H](Cc1cc(F)cc(F)c1)[C@H](O)[C@H]1CN(CCN1)S(=O)(=O)c1cccc(C)c1)N1CCCCS1(=O)=O)c1ccccc1